cis-Umbellulol

Normal alkane RI, non-polar column, custom temperature program

Data compiled by: NIST Mass Spectrometry Data Center, William E. Wallace, director

Column type CapillaryCapillary
Active phase SE-30Polydimethyl siloxanes
Column length (m)
Carrier gas
Substrate
Column diameter (mm)
Phase thickness (μm)
Program not specifiednot specified
I 1053.1053.
ReferenceVinogradov, 2004Zenkevich, 1997
Comment MSDC-RI MSDC-RI

References

Vinogradov, 2004
Vinogradov, B.A., Production, composition, properties and application of essential oils, 2004, retrieved from http://viness.narod.ru. [all data]

Zenkevich, 1997
Zenkevich, I.G., Analytical Parameters of Components of Essential Oils for their Chromatographic and Chromato-Spectral Identificaiton. Oxsigenated derivatives of Mono- and Sesquiterpene Hydrocarbons, Rastit, Resursy (Rus.), 1997, 33, 1, 16-28. [all data]