isopimaridiene

Van Den Dool and Kratz RI, non-polar column, temperature ramp

Data compiled by: NIST Mass Spectrometry Data Center, William E. Wallace, director

Column type Capillary
Active phase DB-1
Column length (m) 30.
Carrier gas
Substrate
Column diameter (mm) 0.2
Phase thickness (μm) 0.25
Tstart (C) 50.
Tend (C) 300.
Heat rate (K/min) 5.
Initial hold (min) 2.
Final hold (min) 5.
I 1972.
ReferenceJohnson, Urso, et al., 1997
Comment MSDC-RI

References

Johnson, Urso, et al., 1997
Johnson, C.I.; Urso, A.; Geleta, L., Broad spectrum analysis of municipal and industrial effluents discharged into the Peace, Athabasca and Slave river basins: characterization of effluent samples, 1994 - Volume 1 of 2, Northern River Basins Study Project Report No. 121, Norther River Basins Study, Edmonton, Alberta, 1997, 27. [all data]