Agglomerone

Van Den Dool and Kratz RI, non-polar column, temperature ramp

View large format table.

Column type Active phase I Reference Comment
CapillaryBP-11669.Tam, Thuam, et al., 200450. m/0.22 mm/0.25 μm, He, 2. K/min, 220. C @ 20. min; Tstart: 60. C

Van Den Dool and Kratz RI, polar column, temperature ramp

View large format table.

Column type Active phase I Reference Comment
CapillaryBP-202356.Tam, Thuam, et al., 200450. m/0.22 mm/0.25 μm, He, 2. K/min, 220. C @ 20. min; Tstart: 60. C

Normal alkane RI, polar column, temperature ramp

View large format table.

Column type Active phase I Reference Comment
CapillaryBP-202381.Bignell, Dunlop, et al., 199825. m/0.33 mm/0.5 μm, H2, 5. K/min; Tstart: 80. C; Tend: 220. C
CapillaryBP-202381.Bignell, Dunlop, et al., 199725. m/0.33 mm/0.5 μm, H2, 5. K/min; Tstart: 80. C; Tend: 220. C
CapillaryBP-202381.Bignell, Dunlop, et al., 1997, 225. m/0.33 mm/0.5 μm, H2, 5. K/min; Tstart: 80. C; Tend: 220. C

References

Tam, Thuam, et al., 2004
Tam, N.T.; Thuam, D.T.; Bighelli, A.; Castola, V.; Muselli, A.; Richomme, P.; Casanova, J., Baeckea frutescens leaf oil from Vietnam: composition and chemical variability, Flavour Fragr. J., 2004, 19, 3, 217-220, https://doi.org/10.1002/ffj.1281 . [all data]

Bignell, Dunlop, et al., 1998
Bignell, C.M.; Dunlop, P.J.; Brophy, J.J., Volatile leaf oils of some South-Western and Southern Australian species of the genus Eucalyptus (Series 1). Part XIX, Flavour Fragr. J., 1998, 13, 2, 131-139, https://doi.org/10.1002/(SICI)1099-1026(199803/04)13:2<131::AID-FFJ710>3.0.CO;2-X . [all data]

Bignell, Dunlop, et al., 1997
Bignell, C.M.; Dunlop, P.J.; Brophy, J.J.; Fookes, C.J.R., Volatile leaf oils of some South-Western and Southern Australian species of the genus Eucalyptus (Series I). Part XIV: Subgenus Monocalyptus, Flavour Fragr. J., 1997, 12, 3, 177-183, https://doi.org/10.1002/(SICI)1099-1026(199705)12:3<177::AID-FFJ626>3.0.CO;2-9 . [all data]

Bignell, Dunlop, et al., 1997, 2
Bignell, C.M.; Dunlop, P.J.; Brophy, J.J., Volatile leaf oils of some South-Western and Southern Australian species of the genus Eucalyptus (Series I). Part XVII: Subgenus symphyomyrtus (i) section bisectaria, series calycogonae and (ii) section dumaria, series dumosae, series rigentes and series ovulares, Flavour Fragr. J., 1997, 12, 269-275. [all data]