cis-Isopulegone

Normal alkane RI, polar column, temperature ramp

Data compiled by: NIST Mass Spectrometry Data Center, William E. Wallace, director

Column type CapillaryCapillary
Active phase HP-InnowaxHP-Innowax FSC
Column length (m) 60.60.
Carrier gas HeHe
Substrate
Column diameter (mm) 0.250.25
Phase thickness (μm) 0.25
Tstart (C) 60.60.
Tend (C) 220.240.
Heat rate (K/min)  4.
Initial hold (min) 10.10.
Final hold (min)  10.
I 1583.1583.
ReferenceKaya, Baser, et al., 1999Baser, Kirimer, et al., 1997
Comment MSDC-RI MSDC-RI

Normal alkane RI, non-polar column, temperature ramp

Data compiled by: NIST Mass Spectrometry Data Center, William E. Wallace, director

Column type Capillary
Active phase HP-5MS
Column length (m) 30.
Carrier gas He
Substrate
Column diameter (mm) 0.25
Phase thickness (μm) 0.25
Tstart (C) 60.
Tend (C) 280.
Heat rate (K/min) 3.
Initial hold (min)
Final hold (min)
I 1173.
ReferenceSlavkovska, Couladis, et al., 2005
Comment MSDC-RI

References

Kaya, Baser, et al., 1999
Kaya, A.; Baser, K.H.C.; Tümen, G.; Koca, F., The essential oil of Acinos suaveolens (Sm.) G. Don fil. Acinos arvensis (Lam.) Dandy and Acinos rotundifolius Pers. growing wild in Turkey, Flavour Fragr. J., 1999, 14, 1, 60-64, https://doi.org/10.1002/(SICI)1099-1026(199901/02)14:1<60::AID-FFJ785>3.0.CO;2-0 . [all data]

Baser, Kirimer, et al., 1997
Baser, K.H.C.; Kirimer, N.; Duman, H., Composition of the essential oil of Micromeria dolichodontha P. H. Davis, Flavour Fragr. J., 1997, 12, 4, 289-291, https://doi.org/10.1002/(SICI)1099-1026(199707)12:4<289::AID-FFJ640>3.0.CO;2-A . [all data]