3β-hydroxyoroboidine

Normal alkane RI, non-polar column, temperature ramp

View large format table.

Column type Active phase I Reference Comment
CapillaryDB-13160.Greinwald, Reyes-Chilpa, et al., 1996He, 6. K/min; Column length: 30. m; Column diameter: 0.32 mm; Tstart: 150. C; Tend: 300. C

References

Greinwald, Reyes-Chilpa, et al., 1996
Greinwald, R.; Reyes-Chilpa, R.; Ross, J.H.; Witte, L.; Czygan, F.-C., A survey of alkaloids in the genera Harpalyce and Brongniartia (Fabaceae - Brongniartieae), Biochem. Syst. Ecol., 1996, 24, 7/8, 749-755. [all data]