8,9-dehydroisolongifolene

Normal alkane RI, non-polar column, custom temperature program

View large format table.

Column type Active phase I Reference Comment
CapillaryHP-11534.Dung, Thanh, et al., 199624. m/0.32 mm/0.25 μm; Program: 60C(2min) => 4C/min => 120C => 2C/min => 220C (20min)

References

Dung, Thanh, et al., 1996
Dung, N.X.; Thanh, L.; Khoi, T.T.; Leclercq, P.A., Compositional analysis of the leaf, stem and rhizome oils of Piper lolot C. DC. from Vietnam, J. Essent. Oil Res., 1996, 8, 6, 649-652, https://doi.org/10.1080/10412905.1996.9701034 . [all data]