Amigdalin, TFA

Van Den Dool and Kratz RI, non-polar column, custom temperature program

View large format table.

Column type Active phase I Reference Comment
CapillaryDB-5MS2328.Chassagne, Crouzet, et al., 199630. m/0.25 mm/0.25 μm, He; Program: not specified
CapillaryDB-5MS2330.Chassagne, Crouzet, et al., 199630. m/0.25 mm/0.25 μm, He; Program: not specified

References

Chassagne, Crouzet, et al., 1996
Chassagne, D.; Crouzet, J.C.; Bayonove, C.L.; Baumes, R.L., Identification and quantification of passion fruit cyanogenic glycosides, J. Agric. Food Chem., 1996, 44, 12, 3817-3820, https://doi.org/10.1021/jf960381t . [all data]