2-(5-methyl-2-furyl)thiazolidine

Normal alkane RI, polar column, temperature ramp

Data compiled by: NIST Mass Spectrometry Data Center, William E. Wallace, director

Column type CapillaryCapillary
Active phase DB-WaxDB-Wax
Column length (m) 60.60.
Carrier gas HeHe
Substrate
Column diameter (mm) 0.250.25
Phase thickness (μm)
Tstart (C) 40.40.
Tend (C) 200.200.
Heat rate (K/min) 2.2.
Initial hold (min) 2.2.
Final hold (min)
I 2251.2251.
ReferenceUmano, Hagi, et al., 1995Umano, Hagi, et al., 1995
Comment MSDC-RI MSDC-RI

References

Umano, Hagi, et al., 1995
Umano, K.; Hagi, Y.; Nakahara, K.; Shyoji, A.; Shibamoto, T., Volatile chemicals formed in the headspace of a heated D-glucose/L-cysteine Maillard model system, J. Agric. Food Chem., 1995, 43, 8, 2212-2218, https://doi.org/10.1021/jf00056a046 . [all data]