(Z)-3-pentenal

Normal alkane RI, polar column, temperature ramp

View large format table.

Column type Active phase I Reference Comment
CapillaryPEG-20M1005.Togari, Kobayashi, et al., 199550. m/0.25 mm/0.15 μm, He, 60. C @ 4. min, 2. K/min; Tend: 180. C

References

Togari, Kobayashi, et al., 1995
Togari, N.; Kobayashi, A.; Aishima, T., Pattern recognition applied to gas chromatographic profiles of volatile components in three tea categories, Food Res. Int., 1995, 28, 5, 495-502, https://doi.org/10.1016/0963-9969(95)00029-1 . [all data]