Preisocalamendiol

Kovats' RI, non-polar column, isothermal

View large format table.

Column type Active phase Temperature (C) I Reference Comment
CapillaryDB-1150.1587.Viswanathan, Maridass, et al., 200228. m/0.25 mm/0.25 μm, He

Kovats' RI, non-polar column, temperature ramp

View large format table.

Column type Active phase I Reference Comment
CapillaryDB-11587.Saad, El-Sharkawy, et al., 199528. m/0.25 mm/0.25 μm, He, 50. C @ 1. min, 4. K/min; Tend: 270. C

References

Viswanathan, Maridass, et al., 2002
Viswanathan, M.B.; Maridass, M.; Thangadurai, D.; Ramesh, N., Chemical constituents of the fruit essential oil of Diospyros malabarica (Desr.) Kostel (Ebenaceae), Acta Pharmaceutica, 2002, 52, 207-211. [all data]

Saad, El-Sharkawy, et al., 1995
Saad, H.-E.A.; El-Sharkawy, S.H.; Halim, A.F., Essential oils of Daucus carota ssp. maximus, Pharm. Acta Helv., 1995, 70, 1, 79-84, https://doi.org/10.1016/0031-6865(94)00054-Y . [all data]