cis-α-Copaen-8-ol

Kovats' RI, polar column, temperature ramp

Data compiled by: NIST Mass Spectrometry Data Center, William E. Wallace, director

Column type Capillary
Active phase Supelcowax-10
Column length (m) 30.
Carrier gas
Substrate
Column diameter (mm)
Phase thickness (μm)
Tstart (C) 40.
Tend (C) 210.
Heat rate (K/min) 2.
Initial hold (min) 2.
Final hold (min) 120.
I 2085.
ReferenceLoayza, Abujder, et al., 1995
Comment MSDC-RI

References

Loayza, Abujder, et al., 1995
Loayza, I.; Abujder, D.; Aranda, R.; Jakupovic, J.; Collin, G.; Deslauriers, H.; Jean, F.-I., Essential oils of Baccharis salicifolia, B. latifolia and B. dracunculifolia, Phytochemistry, 1995, 38, 2, 381-389, https://doi.org/10.1016/0031-9422(94)00628-7 . [all data]