3,4,10,11-Tetradehydrocadinan-8-one

Kovats' RI, non-polar column, temperature ramp

View large format table.

Column type Active phase I Reference Comment
CapillaryDB-51692.Loayza, Abujder, et al., 199540. C @ 2. min, 2. K/min, 210. C @ 120. min; Column length: 30. m
CapillaryDB-51696.Loayza, Abujder, et al., 199540. C @ 2. min, 2. K/min, 210. C @ 120. min; Column length: 30. m

Kovats' RI, polar column, temperature ramp

View large format table.

Column type Active phase I Reference Comment
CapillarySupelcowax-102224.Loayza, Abujder, et al., 199540. C @ 2. min, 2. K/min, 210. C @ 120. min; Column length: 30. m
CapillarySupelcowax-102181.Loayza, Abujder, et al., 199540. C @ 2. min, 2. K/min, 210. C @ 120. min; Column length: 30. m

References

Loayza, Abujder, et al., 1995
Loayza, I.; Abujder, D.; Aranda, R.; Jakupovic, J.; Collin, G.; Deslauriers, H.; Jean, F.-I., Essential oils of Baccharis salicifolia, B. latifolia and B. dracunculifolia, Phytochemistry, 1995, 38, 2, 381-389, https://doi.org/10.1016/0031-9422(94)00628-7 . [all data]