3-acetoxy-2-butanol (2)

Van Den Dool and Kratz RI, polar column, temperature ramp

Data compiled by: NIST Mass Spectrometry Data Center, William E. Wallace, director

Column type CapillaryCapillary
Active phase DB-Wax EtrDB-Wax
Column length (m) 30.30.
Carrier gas HeHe
Substrate
Column diameter (mm) 0.250.25
Phase thickness (μm) 0.25
Tstart (C) 40.40.
Tend (C) 250.200.
Heat rate (K/min) 5.2.
Initial hold (min) 3.10.
Final hold (min) 15.
I 1597.1576.
ReferenceAubert C. and Pitrat M., 2006Umano, Hagi, et al., 1992
Comment MSDC-RI MSDC-RI

References

Aubert C. and Pitrat M., 2006
Aubert C.; Pitrat M., Volatile compounds in the skin and pulp of Queen Anne's pocket melon, J. Agric. Food Chem., 2006, 54, 21, 8177-8182, https://doi.org/10.1021/jf061415s . [all data]

Umano, Hagi, et al., 1992
Umano, K.; Hagi, Y.; Nakahara, K.; Shoji, A.; Shibamoto, T., Volatile constituents of green and ripened pineapple (Aanas comosus [L.] Merr.), J. Agric. Food Chem., 1992, 40, 4, 599-603, https://doi.org/10.1021/jf00016a014 . [all data]