methyl 3-hydroxy-2-methylbutanoate

Van Den Dool and Kratz RI, non-polar column, temperature ramp

Data compiled by: NIST Mass Spectrometry Data Center, William E. Wallace, director

Column type Capillary
Active phase HP-5MS
Column length (m) 30.
Carrier gas He
Substrate
Column diameter (mm) 0.25
Phase thickness (μm) 0.25
Tstart (C) 40.
Tend (C) 200.
Heat rate (K/min) 3.
Initial hold (min) 5.
Final hold (min) 20.
I 930.
ReferenceKim T.H., Kim T.H., et al., 2002
Comment MSDC-RI

References

Kim T.H., Kim T.H., et al., 2002
Kim T.H.; Kim T.H.; Shin J.H.; Yu E.J.; Kim Y.S.; Lee H.J., Characteristics of aroma-active compounds in the pectin-elicited suspension culture of Zanthoxylum piperitum (prickly ash), Biotechnology Letters, 2002, 24, 7, 551-556, https://doi.org/10.1023/A:1014812508441 . [all data]