7-Tetradecanone

Normal alkane RI, non-polar column, temperature ramp

Data compiled by: NIST Mass Spectrometry Data Center, William E. Wallace, director

Column type Capillary
Active phase OV-101
Column length (m) 54.
Carrier gas Helium
Substrate
Column diameter (mm) 0.26
Phase thickness (μm)
Tstart (C) 50.
Tend (C) 240.
Heat rate (K/min) 5.
Initial hold (min) 0.
Final hold (min) 0.
I 1554.
ReferenceZenkevich and Ventura, 1991
Comment MSDC-RI

References

Zenkevich and Ventura, 1991
Zenkevich, I.G.; Ventura, K., Gas Chromatographic Identification of Volatile Products of Thermal Degradation of Bitumen, Zh. Prikl. Khim. (Rus.), 1991, 9, 1974-1979. [all data]