methyl (E)-4-hexenoate

Normal alkane RI, polar column, temperature ramp

View large format table.

Column type Active phase I Reference Comment
CapillaryDB-Wax1237.Takeoka, Buttery, et al., 199160. m/0.32 mm/0.25 μm, He, 30. C @ 4. min, 2. K/min, 180. C @ 25. min

References

Takeoka, Buttery, et al., 1991
Takeoka, G.R.; Buttery, R.G.; Teranishi, R.; Flath, R.A.; Güntert, M., Identification of additional pineapple volatiles, J. Agric. Food Chem., 1991, 39, 10, 1848-1851, https://doi.org/10.1021/jf00010a032 . [all data]