p-Menth-1-en-3,8-diol, cis

Normal alkane RI, non-polar column, temperature ramp

View large format table.

Column type Active phase I Reference Comment
CapillaryDB-11351.Ueno, Masuda, et al., 200460. m/0.25 mm/0.25 μm, N2, 3. K/min, 210. C @ 15. min; Tstart: 80. C
CapillarySE-301362.Peacock and Kuneman, 1985N2, 45. C @ 1. min, 4. K/min; Column length: 100. m; Column diameter: 0.25 mm; Tend: 250. C

References

Ueno, Masuda, et al., 2004
Ueno, T.; Masuda, H.; Ho, C.-T., Formation mechanism of p-methylacetophenone from citral via a tert-alkoxy radical intermediate, J. Agric. Food Chem., 2004, 52, 18, 5677-5684, https://doi.org/10.1021/jf035517j . [all data]

Peacock and Kuneman, 1985
Peacock, V.E.; Kuneman, D.W., Inhibition of the formation of α-p-dimethylstyrene and p-cymen-8-ol in a carbonated citral-containing beverage system, J. Agric. Food Chem., 1985, 33, 3, 330-335, https://doi.org/10.1021/jf00063a003 . [all data]