β-Isopropoxystyrene, (E)

Normal alkane RI, non-polar column, temperature ramp

View large format table.

Column type Active phase I Reference Comment
CapillaryOV-1011274.Mandelshtam, Kharicheva, et al., 1991Helium, 50. C @ 0. min, 3. K/min, 220. C @ 0. min; Column length: 54. m; Column diameter: 0.26 mm

References

Mandelshtam, Kharicheva, et al., 1991
Mandelshtam, T.V.; Kharicheva, E.M.; Gorobets, I.A.; Zenkevich, I.G.; Kostikov, R.R.; Porokhovnikova, E.B., Synthesis and Chromato Mass Spectrometric Investigation of alpha-Alkoxystyrenes, Zh. Org. Khim. (Rus.), 1991, 27, 4, 684-690. [all data]