p-menthen-9-al

Van Den Dool and Kratz RI, polar column, temperature ramp

View large format table.

Column type Active phase I Reference Comment
CapillaryDB-Wax1600.Humpf and Schreier, 199130. m/0.25 mm/0.25 μm, He, 50. C @ 3. min, 4. K/min, 220. C @ 20. min

References

Humpf and Schreier, 1991
Humpf, H.-U.; Schreier, P., Bound aroma compounds from the fruit and the leaves of blackberry (Rubus laciniata L.), J. Agric. Food Chem., 1991, 39, 10, 1830-1832, https://doi.org/10.1021/jf00010a028 . [all data]