3-(hexanoylthio) hexyl hexanoate

Normal alkane RI, polar column, temperature ramp

View large format table.

Column type Active phase I Reference Comment
CapillaryDB-Wax2608.Engel and Tressl, 1991He, 2. K/min; Column length: 60. m; Column diameter: 0.32 mm; Tstart: 70. C; Tend: 230. C

References

Engel and Tressl, 1991
Engel, K.-H.; Tressl, R., Identification of new sulfur-containing volatiles in yellow passion fruits (Passiflora edulis f. flavicarpa), J. Agric. Food Chem., 1991, 39, 12, 2249-2252, https://doi.org/10.1021/jf00012a030 . [all data]