Dibenzodioxin, 1,3,7-tribromo-, 4,8-dichloro-

Van Den Dool and Kratz RI, non-polar column, temperature ramp

View large format table.

Column type Active phase I Reference Comment
CapillaryRTX-52854.Donnelly, Munslow, et al., 199130. m/0.25 mm/0.25 μm, He, 170. C @ 1. min, 2. K/min; Tend: 320. C

References

Donnelly, Munslow, et al., 1991
Donnelly, J.R.; Munslow, W.D.; Grange, A.H.; Pettit, T.L.; Simmons, R.D.; Kumar, K.S.; Sovocool, G.W., A gas chromatographic/mass spectrometric approach for isomer-specific environmental monitoring of the 1700 bromo-, chloro-, and bromoschloro-dibenzo-p-dioxins, Biol. Mass Spectrom., 1991, 20, 5, 329-337, https://doi.org/10.1002/bms.1200200515 . [all data]