Propanoic acid, 2-(4-methoxyphenyl)

Kovats' RI, non-polar column, isothermal

View large format table.

Column type Active phase Temperature (C) I Reference Comment
CapillaryOV-101200.1529.Tarjan, Nyiredy, et al., 1989
PackedOV-101200.1529.Macek and Smolková-Keulemansová, 1985N2, Chromosorb W HP (100-120 mesh); Column length: 2. m

References

Tarjan, Nyiredy, et al., 1989
Tarjan, G.; Nyiredy, Sz.; Gyor, M.; Lombosi, E.R.; Lombosi, T.S.; Budahegyi, M.V.; Meszaros, S.Y.; Takacs, J.M., Review. Thirtieth Anniversary of the Retention Index According to Kovats in Gas-Liquid Chromatography, J. Chromatogr., 1989, 472, 1-92, https://doi.org/10.1016/S0021-9673(00)94099-8 . [all data]

Macek and Smolková-Keulemansová, 1985
Macek, J.; Smolková-Keulemansová, E., Correlation of the chromatographic retention of some phenylacetic and phenylpropionic acid derivatives with molecular structure, J. Chromatogr., 1985, 333, 309-317, https://doi.org/10.1016/S0021-9673(01)87361-1 . [all data]