2,5-diphenyl-1-pentene

Van Den Dool and Kratz RI, non-polar column, temperature ramp

View large format table.

Column type Active phase I Reference Comment
CapillarySE-541900.0Shapi and Hesso, 199025. m/0.32 mm/0.15 μm, He, 40. C @ 1. min, 5. K/min, 280. C @ 15. min

References

Shapi and Hesso, 1990
Shapi, M.M.; Hesso, A., Thermal decomposition of polystyrene volatile compounds from large-scale pyrolysis, J. Anal. Appl. Pyrolysis, 1990, 18, 2, 143-161, https://doi.org/10.1016/0165-2370(90)80004-8 . [all data]