1,4-diphenyl-1-butene

Van Den Dool and Kratz RI, non-polar column, temperature ramp

Data compiled by: NIST Mass Spectrometry Data Center, William E. Wallace, director

Column type CapillaryCapillary
Active phase SE-54SE-54
Column length (m) 25.25.
Carrier gas HeHe
Substrate
Column diameter (mm) 0.320.32
Phase thickness (μm) 0.150.15
Tstart (C) 40.40.
Tend (C) 280.280.
Heat rate (K/min) 5.5.
Initial hold (min) 1.1.
Final hold (min) 15.15.
I 1731.11734.1
ReferenceShapi and Hesso, 1990Shapi and Hesso, 1990
Comment MSDC-RI MSDC-RI

References

Shapi and Hesso, 1990
Shapi, M.M.; Hesso, A., Thermal decomposition of polystyrene volatile compounds from large-scale pyrolysis, J. Anal. Appl. Pyrolysis, 1990, 18, 2, 143-161, https://doi.org/10.1016/0165-2370(90)80004-8 . [all data]