γ-cadina-1,4-diene

Van Den Dool and Kratz RI, polar column, temperature ramp

View large format table.

Column type Active phase I Reference Comment
CapillaryCarbowax 20M1701.Kawakami, Sachs, et al., 1990He, 60. C @ 4. min, 2. K/min; Column length: 50. m; Column diameter: 0.25 mm; Tend: 180. C

References

Kawakami, Sachs, et al., 1990
Kawakami, M.; Sachs, R.M.; Shibamoto, T., Volatile constituents of essential oils obtained from newly developed tea tree (Melaleuca alternifolia) clones, J. Agric. Food Chem., 1990, 38, 8, 1657-1661, https://doi.org/10.1021/jf00098a007 . [all data]