Pentan-2-one, 4-methyl-4-ethoxyamino, O-ethyloxime, anty

Normal alkane RI, non-polar column, temperature ramp

View large format table.

Column type Active phase I Reference Comment
PackedSE-301205.Zenkevich, Artsybasheva, et al., 1989Helium, Chromaton N Super (0.16-0.20 mm), 50. C @ 0. min, 5. K/min, 200. C @ 0. min; Column length: 1.8 m

References

Zenkevich, Artsybasheva, et al., 1989
Zenkevich, I.G.; Artsybasheva, Yu.P.; Ioffe, B.V., On the Use of Alkoxyamines for Derivatization of Carbonyl Compounds in Chromato Mass Spectrometry, Zh. Org. Khim. (Rus.), 1989, 25, 3, 478-482. [all data]