Isothipendyl M (nor-), acetylated

Kovats' RI, non-polar column, temperature ramp

View large format table.

Column type Active phase I Reference Comment
PackedOV-1012600.Maurer and Pfleger, 1988N2, Chromosorb G HP, 100. C @ 3. min, 30. K/min, 310. C @ 5. min; Column length: 0.6 m

References

Maurer and Pfleger, 1988
Maurer, H.; Pfleger, K., Identification of phenothiazine antihistamines and their metabolites in urine, Arch. Toxicol., 1988, 62, 2-3, 185-191, https://doi.org/10.1007/BF00570138 . [all data]