Sesquisabinene hydrate

Van Den Dool and Kratz RI, polar column, temperature ramp

Data compiled by: NIST Mass Spectrometry Data Center, William E. Wallace, director

Column type CapillaryCapillary
Active phase DB-WaxCarbowax 20M
Column length (m) 60.60.
Carrier gas HeHe
Substrate
Column diameter (mm) 0.50.32
Phase thickness (μm) 0.32
Tstart (C) 40.50.
Tend (C) 290.225.
Heat rate (K/min) 4.1.5
Initial hold (min) 2.
Final hold (min) 5.80.
I 2018.1997.
ReferenceBartley and Jacobs, 2000Chen and Ho, 1988
Comment MSDC-RI MSDC-RI

Normal alkane RI, non-polar column, temperature ramp

Data compiled by: NIST Mass Spectrometry Data Center, William E. Wallace, director

Column type Capillary
Active phase DB-5
Column length (m) 30.
Carrier gas Helium
Substrate
Column diameter (mm) 0.25
Phase thickness (μm) 0.25
Tstart (C) 35.
Tend (C) 220.
Heat rate (K/min) 3.
Initial hold (min)
Final hold (min) 40.
I 1547.
ReferenceEl-Massry, El-Ghorab, et al., 2009
Comment MSDC-RI

References

Bartley and Jacobs, 2000
Bartley, J.P.; Jacobs, A.L., Effects of drying on flavour compounds in Australian-grown ginger (Zingiber officinale), J. Sci. Food Agric., 2000, 80, 2, 209-215, https://doi.org/10.1002/(SICI)1097-0010(20000115)80:2<209::AID-JSFA516>3.0.CO;2-8 . [all data]

Chen and Ho, 1988
Chen, C.-C.; Ho, C.-T., Gas chromatographic analysis of volatile components of ginger oil (Zingiber officinale Roscoe) extracted with liquid carbon dioxide, J. Agric. Food Chem., 1988, 36, 2, 322-328, https://doi.org/10.1021/jf00080a020 . [all data]