Pentacosanal

Normal alkane RI, non-polar column, temperature ramp

Data compiled by: NIST Mass Spectrometry Data Center, William E. Wallace, director

Column type CapillaryCapillary
Active phase HP-5MSSE-54
Column length (m) 30.25.
Carrier gas HeN2
Substrate
Column diameter (mm) 0.250.25
Phase thickness (μm) 0.25
Tstart (C) 40.60.
Tend (C) 280.260.
Heat rate (K/min) 10.6.
Initial hold (min) 1.2.
Final hold (min) 20.
I 2738.2733.
ReferenceTkachev, Dobrotvorsky, et al., 2000Bestmann, Classen, et al., 1988
Comment MSDC-RI MSDC-RI

References

Tkachev, Dobrotvorsky, et al., 2000
Tkachev, A.V.; Dobrotvorsky, A.K.; Vjalkov, A.I.; Morozov, S.V., Chemical composition of lipophylic compounds from the body surface of unfed adult Ixodes persulcatus ticks (Acari: Ixodidae), Experimental and Applied Acarology, 2000, 24, 2, 145-158, https://doi.org/10.1023/A:1006430323587 . [all data]

Bestmann, Classen, et al., 1988
Bestmann, H.-J.; Classen, B.; Kobold, U.; Vostrowsky, O.; Klingauf, F.; Stein, U., Steam volatile constituents from leaves of Rhus typhina, Phytochemistry, 1988, 27, 1, 85-90, https://doi.org/10.1016/0031-9422(88)80595-8 . [all data]