Benzoic acid, 2-chloro, dodecyl ester

Kovats' RI, non-polar column, isothermal

View large format table.

Column type Active phase Temperature (C) I Reference Comment
CapillarySE-30160.2313.Korhonen and Lind, 1985N2; Column length: 25. m; Column diameter: 0.33 mm
CapillarySE-30180.2323.Korhonen and Lind, 1985N2; Column length: 25. m; Column diameter: 0.33 mm
CapillarySE-30200.2333.Korhonen and Lind, 1985N2; Column length: 25. m; Column diameter: 0.33 mm

Kovats' RI, polar column, isothermal

View large format table.

Column type Active phase Temperature (C) I Reference Comment
CapillaryOV-351160.2943.Korhonen and Lind, 1985N2; Column length: 25. m; Column diameter: 0.32 mm
CapillaryOV-351180.2963.Korhonen and Lind, 1985N2; Column length: 25. m; Column diameter: 0.32 mm
CapillaryOV-351200.2983.Korhonen and Lind, 1985N2; Column length: 25. m; Column diameter: 0.32 mm

Van Den Dool and Kratz RI, non-polar column, temperature ramp

View large format table.

Column type Active phase I Reference Comment
CapillarySE-302365.Korhonen and Lind, 1985N2, 10. K/min; Column length: 25. m; Column diameter: 0.33 mm; Tstart: 100. C; Tend: 320. C
CapillarySE-302342.Korhonen and Lind, 1985N2, 2. K/min; Column length: 25. m; Column diameter: 0.33 mm; Tstart: 100. C; Tend: 320. C
CapillarySE-302353.Korhonen and Lind, 1985N2, 6. K/min; Column length: 25. m; Column diameter: 0.33 mm; Tstart: 100. C; Tend: 320. C

Van Den Dool and Kratz RI, polar column, temperature ramp

View large format table.

Column type Active phase I Reference Comment
CapillaryOV-3513002.Korhonen and Lind, 1985N2, 10. K/min; Column length: 25. m; Column diameter: 0.32 mm; Tstart: 100. C; Tend: 230. C
CapillaryOV-3512972.Korhonen and Lind, 1985N2, 2. K/min; Column length: 25. m; Column diameter: 0.32 mm; Tstart: 100. C; Tend: 230. C
CapillaryOV-3512993.Korhonen and Lind, 1985N2, 6. K/min; Column length: 25. m; Column diameter: 0.32 mm; Tstart: 100. C; Tend: 230. C

References

Korhonen and Lind, 1985
Korhonen, I.O.O.; Lind, M.A., Gas-liquid chromatographic analyses. XXXV. Capillary column studies of C1-C12 n-alkyl esters of benzoic and monochlorobenzoic acids, J. Chromatogr., 1985, 322, 83-96, https://doi.org/10.1016/S0021-9673(01)97661-7 . [all data]