Medazepam M (nor-), acetylated

Kovats' RI, non-polar column, temperature ramp

View large format table.

Column type Active phase I Reference Comment
CapillaryCross-Linked Methylsilicone2470.Maurer and Pfleger, 198712. m/0.2 mm/0.33 μm, He, 100. C @ 3. min, 30. K/min, 310. C @ 5. min

References

Maurer and Pfleger, 1987
Maurer, H.; Pfleger, K., Identification and differentiation of benzodiazepines and their metabolites in urine by computerized gas chromatography-mass spectrometry, J. Chromatogr., 1987, 422, 85-101, https://doi.org/10.1016/0378-4347(87)80442-5 . [all data]