Formamidine, 1-cyclohexyl-3,3-hexamethyleno

Kovats' RI, non-polar column, isothermal

View large format table.

Column type Active phase Temperature (C) I Reference Comment
PackedSE-30240.1729.Osek, Oszczapowicz, et al., 1986N2, Chromosorb W AW (60-80 mesh); Column length: 3. m

References

Osek, Oszczapowicz, et al., 1986
Osek, J.; Oszczapowicz, J.; Drzewinski, W., Prediction of Retention Indices of N1,N1-Dialkylformamidines on a Non-Polar Column, J. Chromatogr., 1986, 351, 177-182, https://doi.org/10.1016/S0021-9673(01)83486-5 . [all data]