3-(1-pyrrolidinyl)-2-pentanone

Normal alkane RI, polar column, temperature ramp

View large format table.

Column type Active phase I Reference Comment
CapillaryCarbowax 20M1477.Tressl, Rewicki, et al., 19852. K/min; Column length: 25. m; Column diameter: 0.32 mm; Tstart: 70. C; Tend: 180. C

References

Tressl, Rewicki, et al., 1985
Tressl, R.; Rewicki, D.; Helak, B.; Kamperschröer, H., Formation of pyrrolidines and piperidines on heating L-proline with reducing sugars, J. Agric. Food Chem., 1985, 33, 5, 924-928, https://doi.org/10.1021/jf00065a037 . [all data]