(E)-2-butenyl pentaflurobenzoate

Kovats' RI, non-polar column, isothermal

View large format table.

Column type Active phase Temperature (C) I Reference Comment
CapillarySE-30140.1228.Korhonen, 1985N2; Column length: 25. m; Column diameter: 0.33 mm
CapillarySE-30160.1233.Korhonen, 1985N2; Column length: 25. m; Column diameter: 0.33 mm
CapillarySE-30180.1216.Korhonen, 1985N2; Column length: 25. m; Column diameter: 0.33 mm

Kovats' RI, polar column, isothermal

View large format table.

Column type Active phase Temperature (C) I Reference Comment
CapillaryOV-351140.1586.Korhonen, 1985N2; Column length: 25. m; Column diameter: 0.32 mm
CapillaryOV-351160.1586.Korhonen, 1985N2; Column length: 25. m; Column diameter: 0.32 mm
CapillaryOV-351180.1574.Korhonen, 1985N2; Column length: 25. m; Column diameter: 0.32 mm

Van Den Dool and Kratz RI, non-polar column, temperature ramp

View large format table.

Column type Active phase I Reference Comment
CapillarySE-301228.Korhonen, 1985N2, 6. K/min; Column length: 25. m; Column diameter: 0.33 mm; Tstart: 100. C

Van Den Dool and Kratz RI, polar column, temperature ramp

View large format table.

Column type Active phase I Reference Comment
CapillaryOV-3511603.Korhonen, 1985N2, 6. K/min; Column length: 25. m; Column diameter: 0.32 mm; Tstart: 100. C

References

Korhonen, 1985
Korhonen, I.O.O., Gas-liquid chromatographic analyses. XLIV. Benzoyl and pentafluorobenzoyl esters of lower saturated branched-chain and unsaturated alcohols on SE-30 and OV-351 capillary columns, J. Chromatogr., 1985, 329, 359-369, https://doi.org/10.1016/S0021-9673(01)81942-7 . [all data]