Diallyl pentasulfide

Kovats' RI, non-polar column, temperature ramp

View large format table.

Column type Active phase I Reference Comment
CapillarySE-541690.Zoghbi, Ramos, et al., 198430. m/0.25 mm/0.25 μm, He, 50. C @ 3. min, 4. K/min; Tend: 230. C

References

Zoghbi, Ramos, et al., 1984
Zoghbi, M.G.B.; Ramos, L.S.; Maia, J.G.S.; da Silva, M.L.; Luz, A.I.R., Volatile sulfides of the Amazonian garlic bush, J. Agric. Food Chem., 1984, 32, 5, 1009-1010, https://doi.org/10.1021/jf00125a014 . [all data]