Benzoic acid, 4-chloro, 4-pentenyl ester

Kovats' RI, non-polar column, isothermal

View large format table.

Column type Active phase Temperature (C) I Reference Comment
CapillarySE-30140.1596.Korhonen and Lind, 1985
CapillarySE-30160.1606.Korhonen and Lind, 1985
CapillarySE-30200.1616.Korhonen and Lind, 1985

Kovats' RI, polar column, isothermal

View large format table.

Column type Active phase Temperature (C) I Reference Comment
CapillaryOV-351140.2190.Korhonen and Lind, 1985N2; Column length: 25. m; Column diameter: 0.32 mm
CapillaryOV-351160.2211.Korhonen and Lind, 1985N2; Column length: 25. m; Column diameter: 0.32 mm
CapillaryOV-351180.2229.Korhonen and Lind, 1985N2; Column length: 25. m; Column diameter: 0.32 mm

Van Den Dool and Kratz RI, non-polar column, temperature ramp

View large format table.

Column type Active phase I Reference Comment
CapillarySE-301614.Korhonen and Lind, 198510. K/min; Tstart: 100. C; Tend: 280. C
CapillarySE-301600.Korhonen and Lind, 19852. K/min; Tstart: 100. C; Tend: 280. C
CapillarySE-301610.Korhonen and Lind, 19856. K/min; Tstart: 100. C; Tend: 280. C

Van Den Dool and Kratz RI, polar column, temperature ramp

View large format table.

Column type Active phase I Reference Comment
CapillaryOV-3512248.Korhonen and Lind, 1985N2, 10. K/min; Column length: 25. m; Column diameter: 0.32 mm; Tstart: 100. C; Tend: 230. C
CapillaryOV-3512208.Korhonen and Lind, 1985N2, 2. K/min; Column length: 25. m; Column diameter: 0.32 mm; Tstart: 100. C; Tend: 230. C
CapillaryOV-3512221.Korhonen and Lind, 1985N2, 6. K/min; Column length: 25. m; Column diameter: 0.32 mm; Tstart: 100. C; Tend: 230. C

References

Korhonen and Lind, 1985
Korhonen, I.O.O.; Lind, M.A., Gas-liquid chromatographic analyses. XXXVIII. Capillary column studies of unsaturated esters of benzoic and monochlorobenzoic acids, J. Chromatogr., 1985, 324, 113-127, https://doi.org/10.1016/S0021-9673(01)81311-X . [all data]