1,3-Disiloxane, 1,3-dimethyl, 1,3-bis-(chloromethyl), 1,3-bis-ethenyl

Normal alkane RI, non-polar column, temperature ramp

View large format table.

Column type Active phase I Reference Comment
PackedSE-301090.Zenkevich, Finogenov, et al., 1984Helium, Chromosorb W (80-100 mesh), 100. C @ 0. min, 5. K/min, 250. C @ 0. min; Column length: 1.8 m

References

Zenkevich, Finogenov, et al., 1984
Zenkevich, I.G.; Finogenov, Yu.S.; Shchegolev, A.E.; Tumanova, S.V.; Ivin, B.A., Mass Spectrometric characterization of 1,3-Dialkoxy-1,3-disiloxanes, VINITI, # 6806-84, 1984, 22. [all data]