Propoxyphene M (des-Ac, dehydro)

Van Den Dool and Kratz RI, non-polar column, temperature ramp

View large format table.

Column type Active phase I Reference Comment
CapillaryDB-11678.Perrigo, Ballantyne, et al., 198415. m/0.25 mm/0.25 μm, He, 8. K/min, 280. C @ 5. min; Tstart: 120. C

References

Perrigo, Ballantyne, et al., 1984
Perrigo, B.J.; Ballantyne, D.J.; Peel, H.W., Condierations in developing a data base for drugs on a DBI capillary column, J. Can. Soc. Forensic Sci., 1984, 17, 2, 41-49, https://doi.org/10.1080/00085030.1984.10757360 . [all data]