Thioridazine M (nor-), monoacetylated

Normal alkane RI, non-polar column, temperature ramp

View large format table.

Column type Active phase I Reference Comment
PackedOV-1013490.Maurer and Pfleger, 1984N2, Chromosorb G HP, 20. K/min, 310. C @ 3. min; Column length: 0.6 m; Tstart: 100. C

References

Maurer and Pfleger, 1984
Maurer, H.; Pfleger, K., Screening procedure for detection of phenothiazine and analogous neuroleptics and their metabolites in urine using a computerized gas chromatographic-mass spectrometric technique, J. Chromatogr., 1984, 306, 125-145, https://doi.org/10.1016/S0378-4347(00)80876-2 . [all data]