4-Pentenyl benzoate

Kovats' RI, non-polar column, isothermal

View large format table.

Column type Active phase Temperature (C) I Reference Comment
CapillarySE-30140.1447.Korhonen, 1986N2; Column length: 25. m; Column diameter: 0.22 mm
CapillarySE-30160.1442.Korhonen, 1986N2; Column length: 25. m; Column diameter: 0.22 mm
CapillarySE-30180.1463.Korhonen, 1986N2; Column length: 25. m; Column diameter: 0.22 mm
CapillarySE-30140.1439.Korhonen and Lind, 1985
CapillarySE-30160.1447.Korhonen and Lind, 1985
CapillarySE-30200.1452.Korhonen and Lind, 1985

Kovats' RI, polar column, isothermal

View large format table.

Column type Active phase Temperature (C) I Reference Comment
CapillaryOV-351180.2012.Korhonen, 1986N2; Column length: 25. m; Column diameter: 0.22 mm
CapillaryOV-351140.2009.Korhonen and Lind, 1985N2; Column length: 25. m; Column diameter: 0.32 mm
CapillaryOV-351160.2028.Korhonen and Lind, 1985N2; Column length: 25. m; Column diameter: 0.32 mm
CapillaryOV-351180.2042.Korhonen and Lind, 1985N2; Column length: 25. m; Column diameter: 0.32 mm

Van Den Dool and Kratz RI, non-polar column, temperature ramp

View large format table.

Column type Active phase I Reference Comment
CapillarySE-301447.Korhonen and Lind, 198510. K/min; Tstart: 100. C; Tend: 280. C
CapillarySE-301436.Korhonen and Lind, 19852. K/min; Tstart: 100. C; Tend: 280. C
CapillarySE-301445.Korhonen and Lind, 19856. K/min; Tstart: 100. C; Tend: 280. C
CapillarySE-301443.Korhonen, 1985N2, 6. K/min; Column length: 25. m; Column diameter: 0.33 mm; Tstart: 100. C

Van Den Dool and Kratz RI, polar column, temperature ramp

View large format table.

Column type Active phase I Reference Comment
CapillaryOV-3511986.Korhonen, 1986N2, 6. K/min; Column length: 25. m; Column diameter: 0.22 mm; Tstart: 100. C; Tend: 220. C
CapillaryOV-3512042.Korhonen and Lind, 1985N2, 10. K/min; Column length: 25. m; Column diameter: 0.32 mm; Tstart: 100. C; Tend: 230. C
CapillaryOV-3512008.Korhonen and Lind, 1985N2, 2. K/min; Column length: 25. m; Column diameter: 0.32 mm; Tstart: 100. C; Tend: 230. C
CapillaryOV-3512016.Korhonen and Lind, 1985N2, 6. K/min; Column length: 25. m; Column diameter: 0.32 mm; Tstart: 100. C; Tend: 230. C
CapillaryOV-3512016.Korhonen, 1985N2, 6. K/min; Column length: 25. m; Column diameter: 0.32 mm; Tstart: 100. C

Normal alkane RI, non-polar column, temperature ramp

View large format table.

Column type Active phase I Reference Comment
CapillarySE-301444.Korhonen, 1986N2, 6. K/min; Column length: 25. m; Column diameter: 0.22 mm; Tstart: 100. C

References

Korhonen, 1986
Korhonen, I.O.O., Gas-Liquid Chromatographic Analyses. XLVII. Retention Increments of Some Lower Saturated Branched-Chain, Unsaturated and Chlorinated Esters of Benzoic, 4-Nitrobenzoic and 3,5-Dinitrobenzoic Acids on SE-30 and OV-351 Capillary Columns, J. Chromatogr., 1986, 360, 63-78, https://doi.org/10.1016/S0021-9673(00)91652-2 . [all data]

Korhonen and Lind, 1985
Korhonen, I.O.O.; Lind, M.A., Gas-liquid chromatographic analyses. XXXVIII. Capillary column studies of unsaturated esters of benzoic and monochlorobenzoic acids, J. Chromatogr., 1985, 324, 113-127, https://doi.org/10.1016/S0021-9673(01)81311-X . [all data]

Korhonen, 1985
Korhonen, I.O.O., Gas-liquid chromatographic analyses. XLIV. Benzoyl and pentafluorobenzoyl esters of lower saturated branched-chain and unsaturated alcohols on SE-30 and OV-351 capillary columns, J. Chromatogr., 1985, 329, 359-369, https://doi.org/10.1016/S0021-9673(01)81942-7 . [all data]