4-cyclopropyl-2-methoxyphenol

Kovats' RI, polar column, temperature ramp

View large format table.

Column type Active phase I Reference Comment
CapillaryCarbowax 20M2225.Toda, Mihara, et al., 19832. K/min; Column length: 50. m; Column diameter: 0.23 mm; Tstart: 80. C; Tend: 200. C
CapillaryCarbowax 20M2228.Toda, Mihara, et al., 19832. K/min; Column length: 50. m; Column diameter: 0.23 mm; Tstart: 80. C; Tend: 200. C

References

Toda, Mihara, et al., 1983
Toda, H.; Mihara, S.; Umano, K.; Shibamoto, T., Photochemical studies on jasmin oil, J. Agric. Food Chem., 1983, 31, 3, 554-558, https://doi.org/10.1021/jf00117a022 . [all data]