2,5-dichlorohexane, threo

Kovats' RI, non-polar column, isothermal

Data compiled by: NIST Mass Spectrometry Data Center, William E. Wallace, director

Column type Capillary
Active phase Apiezon L
Column length (m) 45.
Carrier gas He
Substrate
Column diameter (mm) 0.25
Phase thickness (μm)
Temperature (C) 90.
I 1005.
ReferenceMorishita, Terashima, et al., 1983
Comment MSDC-RI

References

Morishita, Terashima, et al., 1983
Morishita, F.; Terashima, Y.; Ichise, M.; Kojima, T., Prediction of retention indices from molecular structures of chlorinated alkanes, J. Chromatogr. Sci., 1983, 21, 5, 209-213, https://doi.org/10.1093/chromsci/21.5.209 . [all data]