8,11,14-heptadecatrien-2-one

Kovats' RI, polar column, temperature ramp

View large format table.

Column type Active phase I Reference Comment
CapillaryCarbowax 20M2611.Toda, Yamaguchi, et al., 19822. K/min; Column length: 50. m; Column diameter: 0.28 mm; Tstart: 80. C; Tend: 200. C

References

Toda, Yamaguchi, et al., 1982
Toda, H.; Yamaguchi, K.; Shibamoto, T., Isolation and identification of banana-like aroma from banana shrub (Michellia figo Spreng), J. Agric. Food Chem., 1982, 30, 1, 81-84, https://doi.org/10.1021/jf00109a017 . [all data]