m-N,N-Dimethylaminostyrene

Kovats' RI, polar column, isothermal

View large format table.

Column type Active phase Temperature (C) I Reference Comment
PackedCarbowax 20M150.1859.5Ellis and Still, 1979Chromosorb W, AW-DMCS
PackedCarbowax 20M150.1858.6Ellis and Still, 1979Chromosorb W, AW-DMCS

References

Ellis and Still, 1979
Ellis, T.S.; Still, R.H., Thermal degradation of polymers. XXI. Vacuum pyrolysis of poly(m-N,N-dimethylaminostyrene); the products volatile at pyrolysis temperature, liquid at room temperature, J. Appl. Polym. Sci., 1979, 23, 10, 2837-2854, https://doi.org/10.1002/app.1979.070231002 . [all data]