3B-Hydroxy-5A-androstan-17-one, TMS

Kovats' RI, non-polar column, isothermal

Data compiled by: NIST Mass Spectrometry Data Center, William E. Wallace, director

Column type Packed
Active phase OV-1
Column length (m) 1.
Carrier gas
Substrate Gas Chrom Q
Column diameter (mm)
Phase thickness (μm)
Temperature (C) 230.
I 2566.
ReferenceQuilliam and Westmore, 1978
Comment MSDC-RI

References

Quilliam and Westmore, 1978
Quilliam, M.A.; Westmore, J.B., Sterically crowded trialkylsilyl derivatives for chromatography and mass spectrometry of biologically-important compounds, Anal. Chem., 1978, 50, 1, 59-68, https://doi.org/10.1021/ac50023a020 . [all data]