5α-Androstane-2α,3α,17β-triol, TMS

Kovats' RI, non-polar column, isothermal

View large format table.

Column type Active phase Temperature (C) I Reference Comment
PackedOV-101263.2755.Kerebel, Morfin, et al., 1977N2, Gas-Chrom Q; Column length: 2.1 m

References

Kerebel, Morfin, et al., 1977
Kerebel, A.; Morfin, R.F.; Berthou, F.L.; Picart, D.; Bardou, L.G.; Floch, H.H., Analysis of C19O3 steroids by thin-layer and gas-liquid chromatography and mass spectrometry, J. Chromatogr., 1977, 140, 3, 229-244, https://doi.org/10.1016/S0021-9673(00)93582-9 . [all data]