Benzene-1,3-dicarboxylic acid, 2-hydroxy, dimethyl ester

Kovats' RI, non-polar column, isothermal

View large format table.

Column type Active phase Temperature (C) I Reference Comment
PackedOV-1150.1612.Fedoreev and Maksimov, 1977Gaschrom; Column length: 1.5 m

References

Fedoreev and Maksimov, 1977
Fedoreev, S.A.; Maksimov, O.B., The study of the composition of aromatic esters by gas-liquid chromatography, Solid Fuel Chem. (Engl. Transl.), 1977, 17-22. [all data]