Cadinane-a

Kovats' RI, non-polar column, isothermal

View large format table.

Column type Active phase Temperature (C) I Reference Comment
PackedSF-96150.1437.Maarse, 1975Chromosorb W-AW; Column length: 3.0 m
PackedSF-96150.1443.Maarse, 1975Chromosorb W-AW; Column length: 3.0 m
PackedSF-96150.1438.Maarse, 1975Chromosorb W-AW; Column length: 3.0 m

References

Maarse, 1975
Maarse, H., Hydrogenolysis of terpenes in the injection port of a gas chromatograph. II. Sesquiterpenes, J. Chromatogr., 1975, 106, 2, 369-384, https://doi.org/10.1016/S0021-9673(00)93846-9 . [all data]