4αH,5αH-Eudesmane
- Formula: C15H28
- Molecular weight: 208.3828
- IUPAC Standard InChIKey: DYEQPYSFRWUNNV-AKRBKJBTSA-N
- Chemical structure:

Kovats' RI, non-polar column, isothermal

Column type | Active phase | Temperature (C) | I | Reference | Comment |
---|---|---|---|---|---|
Packed | SF-96 | 150. | 1495. | Maarse, 1975 | Chromosorb W-AW; Column length: 3.0 m |
Packed | SF-96 | 150. | 1495. | Maarse, 1975 | Chromosorb W-AW; Column length: 3.0 m |
Packed | SF-96 | 150. | 1497. | Maarse, 1975 | Chromosorb W-AW; Column length: 3.0 m |
Packed | SF-96 | 150. | 1497. | Maarse, 1975 | Chromosorb W-AW; Column length: 3.0 m |
Packed | SF-96 | 150. | 1497. | Maarse, 1975 | Chromosorb W-AW; Column length: 3.0 m |
Packed | SF-96 | 150. | 1498. | Maarse, 1975 | Chromosorb W-AW; Column length: 3.0 m |

Kovats' RI, polar column, isothermal

Column type | Active phase | Temperature (C) | I | Reference | Comment |
---|---|---|---|---|---|
Packed | Carbowax 20M | 130. | 1632. | Maarse, 1975 | Chromosorb W-AW; Column length: 3.0 m |
Packed | Carbowax 20M | 130. | 1635. | Maarse, 1975 | Chromosorb W-AW; Column length: 3.0 m |
Packed | Carbowax 20M | 130. | 1636. | Maarse, 1975 | Chromosorb W-AW; Column length: 3.0 m |

References

Maarse, 1975
Maarse, H.,
Hydrogenolysis of terpenes in the injection port of a gas chromatograph. II. Sesquiterpenes,
J. Chromatogr., 1975, 106, 2, 369-384, https://doi.org/10.1016/S0021-9673(00)93846-9
. [all data]