5β-Dihydrotestosterone, TMS

Kovats' RI, non-polar column, isothermal

View large format table.

Column type Active phase Temperature (C) I Reference Comment
PackedOV-1225.2528.Voelter, Jung, et al., 1971N2, GasChrom Q

Normal alkane RI, non-polar column, temperature ramp

View large format table.

Column type Active phase I Reference Comment
CapillaryHP-5MS2513.Parr, Zapp, et al., 200716.5 m/0.25 mm/0.25 μm, He, 20. K/min, 320. C @ 2. min; Tstart: 140. C

References

Voelter, Jung, et al., 1971
Voelter, W.; Jung, G.; Breitmaier, E.; Bouchon, G.; Bayer, E.; Gupta, D., Comparison of the trifluoroacetyl and trimethylsilylether derivaties for gas chromatography of steroids, Anal. Chim. Acta., 1971, 53, 1, 185-188, https://doi.org/10.1016/S0003-2670(01)80085-4 . [all data]

Parr, Zapp, et al., 2007
Parr, M.K.; Zapp, J.; Becker, M.; Opfermann, G.; Bartz, U.; Schanzer, W., Steroidal isomers with uniform mass spectra of their per-TMS derivatives: Synthesis of 17-hydroxyandrostan-3-ones, androst-1-, and -4-ene-3,17-diols, Steroids, 2007, 72, 6-7, 545-551, https://doi.org/10.1016/j.steroids.2007.03.006 . [all data]